Details

    • Type: Bug
    • Status: Closed (View Workflow)
    • Priority: Major
    • Resolution: Done
    • Affects Version/s: None
    • Fix Version/s: 1.1.2
    • Component/s: None
    • Labels:
      None
    • Environment:

      Description

      Test is failing causing whole build to fail.

      Run: mvn install
      I am getting:
      Running org.jboss.shrinkwrap.impl.nio.file.FileStoreTestCase
      Tests run: 14, Failures: 0, Errors: 1, Skipped: 0, Time elapsed: 0.199 sec <<< FAILURE!
      (...)
      Tests in error:
      usedSpace(org.jboss.shrinkwrap.impl.nio.file.FileStoreTestCase)

      which causes:
      [INFO] ShrinkWrap NIO.2 Implementation ................... FAILURE [3.465s]

      running maven with -X gets a bit more information:

      Forking command line: cmd.exe /X /C ""C:\Program Files\Java\jdk1.7.0_13\jre\bin\java" -XX:-UseSplitVerifier -jar C:\java\jbossContrib\shrinkwrap\impl-nio2\target\surefire\surefirebooter5511466650885380015.jar C:\java\jbossContrib\shrinkwrap\impl-nio2\target\surefire\surefire1512637945828983343tmp C:\java\jbossContrib\shrinkwrap\impl-nio2\target\surefire\surefire3374467175783166650tmp"
      Running org.jboss.shrinkwrap.impl.nio.file.FileStoreTestCase
      Tests run: 14, Failures: 0, Errors: 1, Skipped: 0, Time elapsed: 0.199 sec <<< FAILURE!

      When I run build with sipping unit tests, it finished with success:

      mvn install -Dmaven.test.skip=true

      I am trying to build latest source code from git repo on master branch

      I will try to further investigate this problem

        Gliffy Diagrams

          Attachments

            Activity

              People

              • Assignee:
                mmatloka Michal Matloka
                Reporter:
                romanj Jan Roman
              • Votes:
                0 Vote for this issue
                Watchers:
                3 Start watching this issue

                Dates

                • Created:
                  Updated:
                  Resolved: